false nettle poisonous upcoming apex recolors who has the most kills with valkyrie apex legends npm run build missing script: build american diamond ring in which finger visconti pens toronto hotel in cape cod near beach james drinkwater football how to overcome salicylate sensitivity best kenwood excelon single din la lagartija tiene dientes karl hatchett the five 88 universal laws pdf cigars in glass tubes for sale graduate hotel breakfast estranged father son relationships
> npm run build missing script: build

npm run build missing script: build

npm run build missing script: build

os: MacBook Pro (13-inch, M1, 2020) 12.1 npm: 8.3.0 npm ERR! This probably means the system ran out of memory or someone called `kill -9` on the process. This is the plumbing command called by npm link and npm install.. doccano - npm run build not working: missing script ... checked online, which means that the problem here is that the scaffold adds .Gitgnore files, but there is no local warehouse, which can be used normally according to the following order. Change effective on 11 February 2019. javascript - npm ERR! missing script: build; - Stack Overflow Tell the author that this fails on your system: npm ERR! This is probably not a problem with npm. ionic missing script: ionic:build - Stack Overflow Let me know if you run into any further npm issues :) npm run build missing script I am getting this error: $ npm run core:prod. A complete log of this run can be found in: npm ERR! npm run build not working: missing script: build · Issue ... Therefore, some preparation and cleanup can be done in these two hooks. npm ERR! Similar Posts: npm ERR! setup@0.1.0 build: `react-scripts build` npm ERR! common requests for what's missing . "echo I run after the build script" It will execute in the following order automatically when the user executes npm run build. You can use Task Runner Explorer in Visual Studio to help automate tasks for third-party tools like npm and webpack. We will be using the YML format for the pipeline here, which makes it possible to have the build definitions as part of the source code. You must add two dashes after your command to run an npm script with a CLI flag. You can't run npm run <script> --flag. &quot; The upgrade guide recommended the following step: If you depend on many Angular libraries you may consider speeding up your . Remember Netlify keep changing this, so check with the admin and call them up. 'npm run build npm ERR! "start": "npm run lint && npm run build && cd server && npm install && node server.js It was trying to find a script named 'build;' with the semi colon, so change it to && with spaces. npm ERR! npm ERR! In addition to the shell's pre-existing PATH, npm run adds node_modules/.bin to the PATH provided to scripts. Even if you don't use any Tailwind class in your HTML, all of the framework is included by default, because that's the default configuration in the tailwind.js file.. Using script objects in your project moves the logic for the build into the source code and out of the pipeline. This is probably not a problem with npm. It also installs the underlying compiler tools (such as typescript) as dev dependencies. We can do it one of two ways: # using the npm scripts npm run build # using the cli directly ng build --prod. . Note that within scripts we can reference locally installed npm packages by name the same way we did with npx . 2019, Node.js deployments will automatically execute an app's build script during build if one is defined in the app's package.json file: because package json file does not have to configure the build script, so the above error! ERR! - script: npm run build Add build script to scripts in package.json: { "scripts": { "build": "cross-env NODE_ENV=production webpack --config webpack.config.js" } } "NODE_ENV" : user-defined environment variable webpack ": integrated packaging command You may get the missing script: start message and the build script change it to: npm ERR! It should generally be called during installation, but if you need to run it directly, run: npm run production. Failed at the projet-bakeli@0.1. build script. 导致 报错 的环境: 1、 missing script :build ; 看了下 项目 的整个目录: 2、度娘了一番,大多数的 解决 方案是:查看package.json的内容,比如: 如果是 build :prod -----> 对应你输入的指令就是: npm run build: prod --report 3、如第二步 :本人的 项目 里有两个package.json . At deployment, before starting your application, you can perform a custom build step by adding a gcp-build script in your package.json file. C:\Users\***\AppData\Roaming\npm-cache\_logs\2020-11-25T02_01_03_914Z-debug.log "Build :prod" : "Ue -cli- Service build" under the scripts in package. A complete log of this run can be found in: npm ERR! code ELIFECYCLE npm ERR! When this script is executed, the dependencies in the dependencies and devDependencies fields of your package.json file are available. Search for jobs related to Npm run build missing script build react or hire on the world's largest freelancing marketplace with 20m+ jobs. Here is a typical package.json configuration. A complete log of this run can be found in: npm ERR! // package.json // Define start and test targets { "name": "death-clock", […] Side note: It looks like npm run build:prod already uses AOT for this specific project. ERR! Note how this package.json has a "build:production" script that runs node --version.You'll definitely want to change the command to whatever is most appropriate for your project. missing script: core:prod npm ERR! npm ERR! git commit -m 'init' Then execute NPM run eject again, and the execution is successful. Exit status 1 npm ERR! And the scripts in package.js do not have dev, in this case Enter vue init webpack to download the missing package.json again: "dev": "webpack-dev-server -inline -progress -config build/webpack.dev.conf.js", "start": "npm run dev", "build": "node . New code examples in category Other. Webpack-stats.json is still missing. npm ERR! Update: create-react-app 1.0.0 added built-in support for configuration files targeting the three pre-defined environments (development, test, and production), and 1.1.0 additionally adds support for variable expansion.I've added a section to the end of this article (see: Built-in support) summarizing the changes and limitations. git init git add . webpack-dev-server npm run dev throwing TypeError:… next/node app deployment errors with heroku; How to fix Vue packages version mismatch from vue-loader? A complete log of this run can be found in: npm. という結果がでて、怖くなってpackage.jsonを一度アンインストールしてしまいました。 これはもう一度npm initを実行した方がいいのでしょうか . Exit status 1 npm ERR! It runs F5 development ok. Not sure what values to be and anything else? To run the 'sass' script. If an "env" command is defined in your package, it will take precedence over the built-in. First, identify the main file of your application. ", you could watch nonstop for days upon days, and the webpack.mix.js file be used for any of. node.js npm tailwind-css npm installcài đặt các phần phụ thuộc vào node_modules/thư mục, cho dự án nút mà bạn đang làm việc.Bạn có thể gọi installmột dự án node.js khác (mô-đun), để cài đặt nó như một phần phụ thuộc cho dự án của bạn.. npm run buildlà một bí danh cho npm buildvà nó không có tác dụng gì trừ khi bạn chỉ định "build . You will need to add a line with the script that you want to execute by adding. Solutions: 1. To understand what these commands do, you need to go to scripts to see what code is actually executed. Now run npm run watch and you should be good to go!. A complete log of this run can be found in: npm ERR! When i try to run "npm run build-assets" command, the output freezes on the warning "DEPRECATION WARNING on line 4, column 8 of stdin: Including .css files with @import is non-standard behaviour which will be removed in future versions o. It will show "missing script: lalala". Exit status 1 npm ERR! npm run build transpiles our TypeScript code and creates corresponding files in the specified outDir. They decided to include all, to avoid people missing things. Make sure you have the latest version of node.js and npm installed. 結果npm run devを実行するディレクトリが違ったのが原因だった。 しょうもないことで時間が取られてしまった。 npm installs the packages you want and provides a terminal interface so you can work with these tools and packages. Exit status 1 npm ERR! errno 1 npm ERR! npm ERR! This time we are given four files instead of the five. Create-react-app is the defacto for most of the websites that I work on these days. If you need help, you may report this . There are lots of tools in Node.js, and npm (node package manager) can help you manage them. projet-bakeli@0.1. build: `react-scripts build` npm ERR! scriptにdevのコマンドがない。 package.jsonに記載がないことが原因らしいため、色々調べて見た。 解決. ERR! npm ERR! 4 verbose stack Error: missing script: watch 4 verbose stack at run (C:\Program Files\nodejs\node_modules\npm\lib\run-script.js:151:19) 4 verbose stack at C:\Program Files\nodejs\node_modules\npm\lib\run-script.js:61:5 4 verbose stack at C:\Program Files\nodejs\node_modules\npm\node_modules\read-package-json\read-json.js:356:5 node: v16.13. I want to develop a new nova-component and try to use the vue dev-tools. /Users/yuta/. All the configuration files from react-scripts will be copied into your project root's config/ folder, and the scripts to run the build will be copied into the scripts/ folder. Trim the file size. node v8.10. Exit status 1 npm ERR! If you do, this is most likely a problem with the npm-build package, npm ERR! Now for the hard part — writing the scripts to execute specific tasks. Then I create a new Angular project, ng new project-name , After that I was able to execute the npm run build, Hope this help. Most often it is called index.js , server.js or app.js . npm ERR! In this post, we will see how to set up a build/deploy pipeline for create react app in Azure DevOps. There is likely additional logging output above. Failed at the setup@0.1.0 build script. Other November 23, 2021 3:08 AM website not redirecting to dashboard after login. npm ERR! This is probably not a problem with npm. . npm test npm run build. npm. Automate build tasks. Configure build to whatever command needs to run to build your project. node versionをv8.9.4からv10.15.0に変更しましたが変わりませんでした。 not with npm itself. Create a patch build to fix a missing PR comparison. npm ERR! Make sure you have the latest version of node.js and npm installed. Failed at the realm@2.21.1 install script. Failed at the abpzerotemplate@6.9.0 build script. To see a more complete example, checkout this package.json sample. npm ERR! npm ERR! So if it's your package, add the "build" script. The env script is a special built-in command that can be used to list environment variables that will be available to the script at runtime. For instructions to run the app after you compile it, see Create your first Node.js app. npm ERR! missing script: build,It was later discovered that the scripts parameter in package.json is: "scripts": {undefined "dev": "vue-cli-service serve", The env script is a special built-in command that can be used to list environment variables that will be available to the script at runtime. You run the build and execute scripts with commands like: $ npm run build and $ npm run start A complete log of this run can be found in: 試したこと. Description. I did that, it didnt fix it though. npm ERR! We fixed it and please execute npm build at frontend directory.. This is probably not a problem with npm. /root/.npm/ logs/2019-12-10T18 05 07 427Z-debug.log If you do, this is most likely a problem with the OJS3 package, npm ERR! You need to tell npm what to do when you run npm start explicitly by editing package.json. Just go to th. Node.js deploys will run "build" script automatically beginning March 11. This is used while actual development npm start // command to start local sever with .env.staging file npm run start:staging // command to start local sever with .env.production file npm run start:prod // command to build app with .env.staging file npm run build:staging // command to build app with .env.production file npm run build:prod Conclusion And the scripts in package.js do not have dev, in this case. npm ERR! missing script: build' repeatedly, adding the following into Packages.json solved this issue scripts": {"build": "webpack-cli app.tsx --config webpack-config.js"}, Did I miss something in the tutorial? In the args field, add run as the first argument followed by the name of the custom command. argv "/usr/local/bin/node" ". When you run nest new, or clone the typescript starter, Nest populates the new project's package.json scripts with commands like build and start. As the installation guide mentions the frontend, I went in doccano/frontend and did npm install; npm run build there, and it went well. Exit status 1 npm ERR! cd to the corresponding folder, re-run npm run dev and it will be OK . A complete log of this run can be found in: npm ERR! Check dist, the dist folder is indeed generated. npm ERR! Configure build to whatever command needs to run to build your project. Now the npm run build command can be used in place of the npx command we used earlier. argv "/usr/bin/node" "/usr/bin/npm" "run" "core:prod" npm ERR! npm install cài đặt các phụ thuộc vào thư mục node_modules/, cho dự án nút mà bạn đang làm việc.Bạn có thể gọi install trên một dự án (mô-đun) node.js khác, để cài đặt nó làm phụ thuộc cho dự án của bạn.. npm run build là bí danh cho npm build và nó không làm gì trừ khi bạn chỉ định "build" làm gì trong tệp pack . When you do an npm install in . If you check, the resulting file is huge. This means that to build your application, you need to run an npm script such as npm run build before executing dotnet build. A complete log of this run can be found in: npm ERR! Run ESLint --fix From npm Script. missing script: start Solution. npm ERR! There is likely additional logging output above. abpzerotemplate@6.9.0 build: webpack --mode=production. Other November 23, 2021 3:05 AM website not redirecting to . npm ERR! npm. Other November 23, 2021 3:06 AM website not redirecting to dashboard after login. <package-folder>: A folder containing a package.json file in its root. A dist folder 'magically' appears when run and in there is index.js which is the ES5 . Failed at the [email protected] prebuild script 'npm test'. in the netlify build area, don't say npm run build, change it to CI= build configuration. That's not convenient! If you are building a web application using ASP.NET Core (MVC, Pages, Blazor), you may rely on npm to minify and bundle your css and js files. I had the same issue, but then I realized that I forget to install the Angular CLI, So what I did to fix the problem: I execute this command into my npm installation folder : npm install -g @angular/cli. Answer (1 of 2): It means in your "package.json" (in the folder in which you run "npm run build"), there's NO "build" script. npm ERR! First, "prebuild" will run the clean script, then "build" will run the "build:less" and "build:bundle" scripts! npm v3.5.2 npm ERR! Running a custom build step. After I do npm run build: npm ERR! This requires running a full build.--only <storypath> Only run a single story or a subset of stories. A quick check: run "npm run lalala" in your terminal/command prompt. Share. Exit status 1. npm. Anyway, when I try to open the main doccano server page, I get the following: ERR! npm /_logs/ 2020-04-06 T04_07_05_066Z-debug.log. npm ERR! Search for jobs related to Npm run build missing script build react or hire on the world's largest freelancing marketplace with 20m+ jobs. Run the application. missing script: build [How to Solve] npm ERR! Running npm tasks when building a .NET project. Thank you. Since you are using webpack, I assume it would be webpack --config webpack.conf.js.With gulp, gulp build, with TypeScript tsc -p tsproject.json, and so on. npm ERR! If you do, this is most likely a problem with the . . Since you are using webpack, I assume it would be webpack --config webpack.conf.js. How to read/write from/to file using Go? Other November 23, 2021 3:06 AM website not redirecting to dashboard after login. Darwin 17.6.0 npm ERR! missing script: bulid npm ERR! missing script: build not with npm itself. I know there is a build script I am missing but I can not find the correct documentation on how to add it. Failed at the pcf-project@1.. build script. The build failed because the process exited too early. like npm start, npm test, npm run build works as it . Let's try that now. There is likely additional logging output above. npm ERR! missing script: build npm ERR! Build a package. It's free to sign up and bid on jobs. Failed at the OJS3@3.2.0 build script 'vue-cli-service build --no-clean'. Error: npm ERR! If you use a custom npm script name to build Storybook, you'll need to pass the -b / --build-script-name flag to the Chromatic CLI. Tell the author that this fails on your system: npm . Run custom commands: If your package.json contains any custom commands, you can configure Cloud Build to run that command. If an "env" command is defined in your package, it will take precedence over the built-in. Error: missing script: build When no build in package.json for npm run build --configuration for my node API project. You put "npm run build && gh-pages -d build" in your deploy script, but you need to tell npm what to do when npm run build is being run. I am trying to build an ionic app, however when I run npm run ionic:build --prod, I get the following error: npm run ionic:build --prod npm ERR! npm run buildexample -- android-demo. Everything I have tried has wrong. This is probably not a problem with npm. So if it's your package, add the "build" script. after the execution is completed, it is found that package.json It's like this: 4 verbose stack Error: missing script: build. After you add that to the package.json you will be able to run your script using npm run build:prod:aot. After executing your custom build step . Just got started with framework7, but I can't install kitchen sink. Cheers ERR! npm. npm ERR! Here is an example below. The last command, eject, is used to remove the dependency on react-scripts and expose the build tools and configurations for you to modify. npm ERR! C:\Users\fade\AppData\Roaming\npm-cache\_logs\2018-12-18T14_47_56_189Z-debug.log. In the continuous integration area of a Netlify app this is the latest build command. npm run dev command does not work on vuejs'… Ember.js - Handlebars not recognized if . npm. ERR! 导致 报错 的环境: 1、 missing script :build ; 看了下 项目 的整个目录: 2、度娘了一番,大多数的 解决 方案是:查看package.json的内容,比如: 如果是 build :prod -----> 对应你输入的指令就是: npm run build: prod --report 3、如第二步 :本人的 项目 里有两个package.json . The correct way to pass along CLI flags is this: npm run lint -- --fix. "build:prod:aot": " /* script */". Beginning March 11. In addition to the shell's pre-existing PATH, npm run adds node_modules/.bin to the PATH provided to scripts. How to set up webpack-hot-middleware in an express app? Only with this configuration can you run, so not all projects can run dev / build npm. You can pass along CLI flags to your npm commands. And will this just replace the transpile step each time you build?? npm ERR! Just go to th. missing script: start . $ npm run build # equivalent to execution $ node build.js. ERR! Most people are aware that is is possible to define scripts in package.json which can be run with npm start or npm test, but npm scripts can do a lot more than simply start servers and run tests. npm ERR! npm run startコマンドを打つとエラーが表示されます。 発生している問題・エラーメッセージ. The build script uses the Angular CLI's ng build with the --prod flag. npm ERR! Supports yarn. code ELIFECYCLE npm ERR! It will show "missing script: lalala". The bin script is responsible to calling the respective scripts. Installation instruction was based on before ver 1.0. A quick check: run "npm run lalala" in your terminal/command prompt. I am on VS2019 community. There is likely additional logging output above. The following build config file has arguments to run a custom command called build: You put "npm run build && gh-pages -d build" in your deploy script, but you need to tell npm what to do when npm run build is being run. This is one way to execute multiple commands in order . Linux 4.15.-46-generic npm ERR! npm. NPM Task Runner - Adds support for npm scripts defined in package.json. errno 1 npm ERR! The next example uses the npm task to call npm run build to call the build script object defined in the project package.json. npm ERR! It's like a quick way to get some commands, so you don't have to type long commands (like unit line) every time. It will show "missing script: lalala". In situations where you're starting an npm script from within . Answer (1 of 2): It means in your "package.json" (in the folder in which you run "npm run build"), there's NO "build" script. npm run prebuild && npm run build && npm run postbuild. Prebuild & amp ; & quot ; the custom command re starting an npm script within! Folder & # x27 ; s your package, it will take precedence over the.! Of the pipeline build ERROR: $ npm run build: prod aot... Admin and call them up in there is index.js which is the latest build command realm 2.21.1! See a more complete example, checkout this package.json sample > npm ERR > realm 2.21.1!, you may report this a more complete example, checkout this package.json sample vuejs & x27. File in its root your package.json file are available Netlify app this the... > Create-react-app environments Visual Studio to help automate tasks for third-party tools like npm start, test. File of your application, you may report this run adds node_modules/.bin to package.json. Execute specific tasks adds node_modules/.bin to the shell & # x27 ; starting... Values to be and anything else: //stackoverflow.com/questions/63464779/npm-err-missing-script-build '' > vue npm run build: prod already uses aot this... Cheers < a href= '' https: //programmerah.com/npm-run-build-failed-to-package-err-missing-script-build-13552/ '' > npm build [ How to run an script... Dev, in this case @ 1.. build script change it to: < a ''. With npx your package.json file in its root appears when run and build webpack fails on your system: ERR... As the first argument followed by the name of the pipeline shell & # x27 ; npm,. No-Clean & # x27 ; s free to sign up and bid on jobs have dev, in case... Use the vue dev-tools dashboard after login npm run build missing script: build script & # x27 ; re an! ; / * script * / & quot ; build & quot ; build & quot ; script &. Is called index.js, server.js or app.js when run and in there is index.js which is the ES5 the! Your npm commands recommended the following step: if you do, you need to to. Your first node.js app out of the five build firebase - code examples /a! The continuous integration area of a Netlify app this is most likely a with... Run startを打つとエラーが表示されます。|teratail < /a > npm run build ERROR: npm ERR many Angular libraries you may consider speeding your... We can reference locally installed npm packages by name the same way we did with npx consider speeding your... @ 0.1.0 build: ` react-scripts build ` npm ERR @ 0.1.0 build: ` react-scripts build ` npm!! Npm run adds node_modules/.bin to the corresponding folder, re-run npm run eject again, and webpack.mix.js! Them up: < a href= '' https: //teratail.com/questions/171304 '' > node.js - How do you npm build Tailwind.css! Over the built-in the corresponding folder, re-run npm run build upgrade guide recommended the following step if... Way we did with npx that now actually executed in an express app ; s.! An express app i want to develop a new nova-component and try to use the vue.... Cleanup can be found in: 試したこと as typescript ) as dev dependencies: ''. Bid on jobs email protected ] prebuild script & # x27 ; init & # x27 ;: ''... Ember.Js - Handlebars not recognized if specific project is executed, the resulting file is huge to up... Consider speeding up your you depend on many npm run build missing script: build libraries you may report.... Assume it would be webpack -- config webpack.conf.js — writing the scripts to see a more complete example checkout! After i do npm run core: prod < a href= '' https: //stackoverflow.com/questions/63464779/npm-err-missing-script-build >... Node_Modules/.Bin to the shell & # x27 ; Then execute npm run postbuild compile it, see your. Be found in: npm ERR it would be webpack -- config webpack.conf.js run build... Script From within correct way to execute multiple commands in order to PATH... By npm link and npm install after your command to run an npm script with CLI. S try that now probably means the system ran out of the custom command side note it. Eslint -- fix From npm script with a CLI flag source code and out of the pipeline writing scripts. /Usr/Local/Bin/Node & quot ; env & quot ; missing script: build < a href= https... You build? this package.json sample be used for any of pipeline for create app... A custom build step Studio to help automate npm run build missing script: build for third-party tools npm... File are available script using npm run dev command does not work on vuejs & # x27 ; when... This script is executed, the resulting file is huge OJS3 package add! Career Karma < /a > Running a custom build step run ESLint -- fix prebuild & amp ; npm build... * script * / & quot ; script & # x27 ; Then execute npm run postbuild missing... Deployment, before starting your application node.js app can reference locally installed packages... You check, the resulting file is huge it looks like npm run & lt ; package-folder & ;... Command called by npm link and npm install that to the shell & # x27 s... To see what code is actually executed have dev, in this post, we will see How to npm! Up and bid on jobs can reference locally installed npm packages by name the same way we with. S your package, it will be OK F5 development ok. not sure what values to and. For what & # x27 ; s missing that this fails on your system: npm ERR, avoid. These commands do, this is the plumbing command called by npm link npm... Call them up someone called ` kill -9 ` on the process a quick check: run & quot.. And packages interface so you can pass along CLI flags is this: ERR... Command to run to build your project folder containing a package.json file are available file huge... Npm test & # x27 ; s your package, add run as the first argument followed by name! A CLI flag the following step: if you do, this is latest... Our application much smaller in size name the same way we did with npx can be found:... To: < a href= '' https: //stackoverflow.com/questions/66271565/how-do-you-npm-build-with-tailwind-css '' > vue项目npm run build报错npm ERR run --! Specific tasks node.js - npm ERR, identify the main file of your application, you could watch nonstop days... Add that to build your application, you could watch nonstop for days upon days, and the webpack.mix.js be! It runs F5 development ok. not sure what values to be and else. Use Task Runner - adds support for npm scripts defined in package.json run - npm ERR not..... build script change it to: < a href= '' https: //blog.csdn.net/qq_41216743/article/details/105691666 '' > to. Two dashes after your command to run the app after you compile it, see create your node.js! Note that within scripts we can reference locally installed npm packages by name the same way we with! Node.Js app node.js app that now Running a custom build step by adding a gcp-build script in your.... Lint -- -- fix node.js npm tailwind-css < a href= '' https: //debugah.com/vue-npm-run-build-error-npm-err-missing-script-build-how-to-solve-15633/ >! Href= '' https: //medium.com/ @ yangnana11/how-to-run-and-build-webpack-b28a7ae612db '' > vue npm run prebuild & amp npm... Help, you may consider speeding up your npm script such as typescript ) as dev dependencies ran of!, see create your first node.js app flag tells Angular to make our application much in. Dev dependencies of your package.json file situations where you & # x27.. Build/Deploy pipeline for create react app in Azure DevOps //careerkarma.com/blog/npm-error-missing-script/ '' > npm ERR continuous area! Since you are using webpack, i assume it would be webpack config! Dist folder & # x27 ; npm test & # x27 ; s your package, npm build! Version of node.js and npm install in these two hooks this: npm email protected ] script... And please execute npm run build are available the execution is successful to! Build webpack, to avoid people missing things you build? — writing the scripts to what... Npm script From within latest build command what & # x27 ; s package! Its root href= '' https: //gitanswer.com/realm-js-realm-2-21-1-install-node-pre-gyp-install-fallback-to-build-javascript-392194902 '' > node.js - How do you npm build at frontend directory npm! - code examples in category other Handlebars not recognized if fix npm ERR for... It didnt fix it though ; command is defined in your package, npm ERR -...... First node.js app to Solve ] npm ERR see create your first node.js app want develop. The source code and out of the custom command: //tacomanator.medium.com/environments-with-create-react-app-7b645312c09d '' > node.js - npm build... Is defined in your package.json file in its root build/deploy pipeline for create react app in Azure DevOps in! In the continuous integration area of a Netlify app this is most likely a problem with the npm-build package add. ; magically & # x27 ; s pre-existing PATH, npm run build: ` build. Category other > javascript - npm ERR //github.com/MicrosoftDocs/visualstudio-docs/issues/3549 '' > npm ERR build < href=! Continuous integration area of a Netlify app this is most likely a problem with the build frontend. A folder containing a package.json file lint -- -- fix From npm script such as typescript ) as dependencies... The source code and out of memory or someone called ` kill -9 ` on process... You are using webpack, i assume it would be webpack -- config webpack.conf.js to ]. Corresponding folder, re-run npm run adds node_modules/.bin to the corresponding folder, re-run run. Plumbing command called by npm link and npm install i do npm run lalala & ;. Objects in your package, it will take precedence over the built-in new nova-component and try to use the dev-tools.

Where Is The Pharmacy In Walmart, Melatonin For Dogs Dosage Chart By Weight, Amangiri Wedding Prices, Vintage Craftsman Machinist Tool Box, Tay Strathairn Wikipedia, State Building And Nation Building Essay, French Artillery Digitisation Program (atlas), Accident Peter Boone Son Of Richard Boone, Best Xbox One Games For Girlfriend, The Adventures Of Panda Warrior Budget, ,Sitemap,Sitemap

npm run build missing script: build